Aanbieding
type: Concept
definition: Aanbieding is een term uit de marketing waar een klant een product met korting of ander voordeel krijgt aangeboden, vaak tijdelijk.
alternative label: aanbiedingen
alternative label: deal
alternative label: deals
alternative label: koopje
alternative label: koopjes
alternative label: korting

Aanhanger
type: Concept
definition: Een aanhangwagen of aanhanger is een niet-aangedreven voertuig met een bepaald laadvermogen bestemd om door een ander voertuig met aandrijving via de trekhaak in beweging te worden gebracht. Voor kleine aanhangers van minder dan 750 kg, inclusief laadvermogen, heeft de bestuurder van de auto geen apart rijbewijs nodig.
alternative label: aanhanger
alternative label: aanhangermassa
alternative label: aanhangwagen
alternative label: remork
alternative label: volgwagen

Abonnement
type: Concept
definition: Een abonnement is een overeenkomst tussen een leverancier van een bepaald product of dienst en een afnemer daarvan, de abonnee. Een bepaald product of dienst wordt periodiek geleverd, vaak in ruil voor betaling door de abonnee. In het openbaar vervoer wordt een abonnement ook wel een propositie genoemd. Een abonnement voor een sportstadion heet seizoenskaart, wat in het Engels ook de naam is voor een abonnement voor het openbaar vervoer.
alternative label: lidmaatschap
narrower: Internet abonnement
narrower: Streamingdienst
narrower: Telefonie abonnement
narrower: Tijdschrift

AI
type: Concept
definition: Kunstmatige intelligentie (KI) of artificiële intelligentie (AI) is het nabootsen van menselijke vaardigheden met een computersysteem, zoals: het aanleren, redeneren, anticiperen en plannen om zichzelf automatisch bij te sturen. Het wordt door een team van software engineers ontworpen, geconfigureerd en getest tot het zelfstandig kan beslissen zonder tussenkomst van menselijke intelligentie.
narrower: Chatbot

Amsterdam
type: Concept
definition: Amsterdam is sinds 1808 de hoofdstad van Nederland. De stad ligt aan het IJ, het Noordzeekanaal en de monding van de Amstel in de gelijknamige gemeente Amsterdam in de provincie Noord-Holland. De gemeente Amsterdam is in Nederland de gemeente met de meeste inwoners.
has geometry: MultiPolygon
  subject: Geometrie
  description: Multipolygon geometrie.

Antiek
type: Concept
definition: Het woord antiek is een verzamelnaam voor oude kunst-, sier- en gebruiksvoorwerpen.
alternative label: Antiquiteit

Apotheek
type: Concept
definition: Een apotheek is een plek waar men geneesmiddel verstrekt en soms ook vervaardigt. Het woord apotheek komt uit het Grieks, ἀποθήκη, apothḗkē, bergplaats. Het werd vroeger gebruikt voor de ruimte (apotheca) in een klooster waar de geneeskrachtige kruiden werden bewaard. Tot ca. 1960 was in Nederland een huisarts op het platteland vaak ook apotheekhouder. In een apotheek heeft de apotheker de eindverantwoordelijkheid. De patiënt wordt er meestal geholpen door een apothekersassistent.

Aquarium
type: Concept
definition: Een openbaar of publiek aquarium is een dierentuin met vissen en andere zeedieren. Het onderscheidt zich van een gewoon aquarium, waarbij vaak gedoeld wordt op een enkelvoudige waterbak met dieren. Een openbaar aquarium is echter een groot geheel aan verschillende aquaria met toegang voor bezoekers. Sinds de eerste openbare aquaria gebouwd werden halverwege de 19e eeuw is het een populair concept geworden, en sinds de 20e eeuw kan men overal ter wereld aquaria terugvinden. Dit kan gaan van erg klein, met slechts enkele aquariumtanks, tot zeer groot, met miljoenen liters water. De meeste huidige openbare aquaria proberen bezoekers op de hoogte te stellen van conservatie.
alternative label: aquarium
alternative label: aquarium open voor publiek

Arcade game
type: Concept
definition: Een arcadespel, ook wel speelkast of speelautomaat genoemd, is een muntslikkende vermaakmachine die men vroeger veelvuldig in restaurants, cafés, snackbars, speelhallen en andere vermaakscentra vond. Ook op kermissen waren kramen te vinden waar arcadespellen konden worden gespeeld. Voorbeelden zijn een uitbetalingsspel, computerspel of flipperkast.

Archief
type: Concept
definition: Geheel van archiefbescheiden, ontvangen of opgemaakt door een persoon, groep personen of organisatie.
alternative label: Archieven
alternative label: Archivering

Armband
type: Concept
definition: Een armband is een sieraad dat om de pols of bovenarm (bovenarmband) wordt gedragen.
alternative label: arm bracelet
related: Juwelier
related: Sieraad

Artiest
type: Concept
definition: Een artiest of uitvoerend kunstenaar is iemand die zijn of haar artistieke begaafdheid gebruikt om in het openbaar op te treden. Artiest is een ruim begrip, het omvat onder andere muzikanten/musici van allerlei genres, dansers, acteurs, kleinkunstenaars, komedianten, goochelaars en illusionisten.
alternative label: artiest
alternative label: podiumkunstenaar

Atletiek
type: Concept
definition: Atletiek is een sport waar de sporters (atleten) individueel of in groepen (estafette) moeten presteren. Atletiek wordt zowel op de weg, in het veld als op een atletiekbaan beoefend. Atletiek wordt wel 'de moeder der sporten' genoemd omdat het de menselijke basisbewegingen omvat.

Attractie
type: Concept
narrower: Aquarium
narrower: Escaperoom
definition: Een toeristische attractie of dagattractie is een aantrekkelijk punt voor toerisme en recreatie.
alternative label: bezienswaardigheid

Attractiepark
type: Concept
definition: Een attractiepark is een gecentraliseerd en immobiel amusementsoord waar, meestal tegen één toegangsprijs, grote attracties zijn opgesteld. De attracties kunnen uiteenlopen van een sprookjestuin tot de meest geavanceerde achtbanen.
alternative label: pretpark

Auto
type: Concept
definition: Een auto of automobiel is een zelfstandig voortbewegend, rijdend vervoermiddel.
narrower: Autoverhuur
narrower: Autodealer
narrower: Autogarage
narrower: Autoverzekering

Autoverhuur
type: Concept

Autodealer
type: Concept

Autogarage
type: Concept

Automerk
type: Concept
definition: Merk van een autofabrikant.

Autoverzekering
type: Concept
definition: Een autoverzekering is een ruime term voor velerlei verzekeringen die tot doel hebben de schade aan of veroorzaakt door de eigen auto te verzekeren. Een autoverzekering is in de landen van de Europese Unie verplicht. Deze verplichting wordt in Nederland geregeld in de Wet aansprakelijkheidsverzekering motorrijtuigen (WAM), in België door de Wet betreffende de verplichte aansprakelijkheidsverzekering inzake motorrijtuigen.
alternative label: auto insurance
alternative label: automobile insurance
alternative label: car insurance
alternative label: motor vehicle insurance

Baby
type: Concept
definition: Een baby is een kind in de eerste levensfase. Deze fase wordt gevolgd door die van peuter. Vaak wordt ook een foetus of ongeboren kind, dus nog in de baarmoeder, een baby genoemd.
alternative label: 0-year-old
alternative label: babies
alternative label: baby
alternative label: infants
alternative label: zero-year-old

Badkamer
type: Concept
definition: Een badkamer is een sanitaire ruimte in een woning, ingericht voor het wassen van het lichaam of delen van het lichaam. Voorzieningen die in een badkamer aanwezig kunnen zijn, zijn een douche, kuipbad, een wastafel en bidet. Vaak is er ook een wc aanwezig.

Bakker
type: Concept
definition: Bakker of bakkerin is een beroep dat kan onderverdeeld worden in twee grote groepen: Iemand die als beroep brood, koek en dergelijke bakt en verkoopt, een ambachtelijke bakker genaamd. Broodslijter of venter, die niet zelf bakt, in Nederland een koude bakker genaamd.

Bankieren
type: Concept
definition: Internetbankieren is het giraal betalen en sparen via internet en internetapplicaties. De communicatie tussen de klant en de bank gaat over het internet. Een klant kan een rekening bij een bank met de computer beheren en transacties met internet aan de bank opgeven. De klant heeft op de computer inzicht in de financiële overzichten die horen bij het rekeningnummer. Alle grote banken in Nederland en België bieden hun klanten een vorm van internetbankieren aan. Voordeel voor de bank is onder andere het niet zelf hoeven invoeren van de mutaties en de afname van het aantal afschriften dat moet worden verstuurd. Voordeel voor de klant is de mogelijkheid om 24 uur per dag de bankzaken te regelen of te bekijken. Dit betekent niet dat de transacties door de bank per direct worden gedaan. Daarvoor heeft men in Europa een nieuwe standaard in het leven geroepen, te weten Instant Payments.

Basisonderwijs
type: Concept
definition: Met basisonderwijs of primair onderwijs wordt het onderwijs bedoeld aan kinderen in de leeftijd van ongeveer vier jaar tot twaalf jaar. In de meeste ontwikkelde landen is het basisonderwijs verplicht via de leerplicht. In het basisonderwijs worden elementaire zaken onderwezen als rekenen en taal. Het basisonderwijs heeft daarmee een belangrijke functie in het voorkomen van analfabetisme. Het recht op basisonderwijs is opgenomen als artikel 26 van de Universele Verklaring van de Rechten van de Mens.
alternative label: lager onderwijs

Bed
type: Concept
definition: Een bed is een meubelstuk om in te slapen, en bestaat uit een ledikant met daarop een matras met beddengoed, zoals lakens en dekens of een dekbed, een dekbedovertrek en een hoofdkussen. Een bed staat meestal in een slaapkamer, maar men sliep bijvoorbeeld tot in de 19e eeuw in Nederlandse huizen overwegend in een bedstede. Het woord 'bed' wordt pars pro toto ook gebruikt als eenheidsmaat wanneer men spreekt over de capaciteit van bijvoorbeeld een ziekenhuis.

Bed and Breakfast
type: Concept
definition: Logies en ontbijt is een gelegenheid, doorgaans een woonhuis, waar men tegen betaling kan overnachten en ontbijten. Een en ander wordt ook wel aangeduid met de Engelse term Bed and Breakfast. In Friesland heet het Bêd & Brochje.

Bedrijf
type: Concept
definition: Een bedrijf of onderneming is een organisatie van arbeid en kapitaal, die economisch actief is in de productie, of in het aanbieden van goederen of diensten. In de (klassieke) economische theorie zijn bedrijven gericht op het maken van winst. Een bedrijf dat tastbare producten maakt wordt een fabriek genoemd.
alternative label: onderneming

Belgie
type: Concept
definition: België, officieel het Koninkrijk België, is een West-Europees land dat aan de Noordzee ligt en aan Nederland, Duitsland, Luxemburg en Frankrijk grenst. Het land is 30.689 km² groot en heeft een bevolking van meer dan 11,826 miljoen inwoners. Brussel is de hoofdstad van België en tevens het bestuurlijk centrum van de Europese Unie en de NAVO.
alternative label: BE
alternative label: vlaanderen

Bestellen
type: Concept
definition: Bestellen is het geven van een opdracht om een goed of dienst te leveren. Een bestelling maakt vaak deel uit van het koopproces na het opstellen van een koopovereenkomst. Bij post- en pakketbezorging betekent bestellen het verzorgen van de levering. Juridisch wordt het bestellen gezien als een rechtshandeling met eigendomsoverdracht als rechtsgevolg.

Betaaldienst
type: Concept

Beurs
type: Concept

Bezorgdienst
type: Concept
definition: Een postbedrijf of posterij is een bedrijf dat post inzamelt, vervoert en bezorgt.
alternative label: posterij

Bierfestival
type: Concept
definition: Een bierfestival is een evenement waar bezoekers een verscheidenheid aan bieren kunnen proeven en kopen. Er kan sprake zijn van een thema, bijvoorbeeld bieren uit een bepaald gebied, of een bepaalde brouwstijl. Naast het aanbod van diverse bieren zijn er doorgaans ook foodtrucks, muziekoptredens of andere soorten entertainment aanwezig.
alternative label: bierfeest

Bioscoop
type: Concept
definition: Een bioscoop is een publieke uitgaansgelegenheid die gericht is op het bekijken van films. Bioscopen maken onderscheid tussen een cityplex, een multiplex en een megaplex. De verschillende zalen in een bioscoop hebben meestal een verschillend aantal zitplaatsen.

Boek
type: Concept
definition: Een boek is een geschreven werk van aanzienlijke omvang, gemaakt door een of meer auteurs. Boeken kunnen in verschillende vormen voorkomen, zoals gedrukte boeken, luisterboeken en elektronische boeken (e-books). Boeken worden over het algemeen onderverdeeld in fictie, met verzonnen verhalen of andere denkbeeldige inhoud; en non-fictie, met inhoud die bedoeld is als feitelijke waarheid.
narrower: Studieboek
narrower: Tijdschrift
narrower: Young Adult

Boerderijwinkel
type: Concept
definition: Een boerderijwinkel is een verkooppunt van boerenproducten, meestal op de boerderij zelf waar deze producten geproduceerd worden en de verkoop is meestal gericht op particulieren. Via dit concept wordt de teelt van lokale en verse producten gesteund.

Bordspel
type: Concept
definition: Een bordspel is een spel dat wordt gespeeld op een tevoren gemarkeerd oppervlak, dat gewoonlijk op een huiskamertafel kan liggen. Dit spelbord en de bijbehorende speelstukken vormen het belangrijkste verschil met andere gezelschapsspellen; er bestaan echter combinaties en tussenvormen van bordspelen met andere speltypes. Zo kan een kanskaart van een bordspel de opdracht bevatten om te dribbelen met een voetbal.

Bouwmarkt
type: Concept
definition: Een bouwmarkt is een winkel die hoofdzakelijk doe-het-zelfproducten verkoopt.

Busreis
type: Concept

Buurt
type: Concept

Cadeaukaart
type: Concept
definition: Een cadeaubon is een waardebon, in het bijzonder een bon waar iemand gewoon de waarde voor betaalt, en deze als cadeau aan iemand anders geeft. Soms ziet zo'n bon er extra feestelijk uit.

Camper
type: Concept
definition: Een kampeerauto, vaak ook wel camper, kampeerwagen, mobilhome, zwerfwagen of motorhome genoemd, is een motorvoertuig, dat is ingericht om in te overnachten en te verblijven. In West-Europa worden campers vooral gebruikt voor vakanties. Zolang het om vakanties gaat is het slapen in een camper een vorm van kamperen. Een camper heeft een eigen motor en stuurinrichting en verschilt zo van een caravan.
alternative label: kampeerauto

Caravan
type: Concept
definition: Een caravan is een verplaatsbare woning die met behulp van een trekhaak achter een auto kan worden bevestigd, dus een aanhangwagen om in te kamperen. Voor de meeste mensen is een caravan uitsluitend hun woning gedurende een vakantie, maar sommigen wonen er permanent in. Vaak zijn dit mensen met een beroep waarvoor zij voortdurend moeten reizen, bijvoorbeeld medewerkers van een circus.
alternative label: sleurhut

Carnaval
type: Concept
definition: Carnaval is van oorsprong een gekerstend heidens volksfeest. Het valt binnen de christelijke traditie op de zondag, maandag en dinsdag direct voorafgaand aan de vastentijd van 40 dagen. In Nederland wordt het van oorsprong alleen door katholieken gevierd, voornamelijk in het zuiden en delen van het oosten. Ook in België en het katholieke Rijnland in Duitsland wordt uitbundig carnaval gevierd. Vastelaovend zoals het in Limburg wordt genoemd, is een feest van saamhorigheid, traditie en vieren. Carnaval is bij uitstek het feest van zotheid, spot en uitbundigheid. Inmiddels is het in verschillende plaatsen in Nederland een gebruik om carnaval op carnavalsvrijdag te openen. Het carnavalsfeest wordt in bijna alle steden en dorpen vooral georganiseerd door de lokale carnavalsvereniging(en) vaak afgekort tot KV, in plaats van het "correcte" CV. De carnavalsperiode begint op de 11e van de 11e voorafgaand aan het carnavalsfeest het jaar daarop. Tot het feest behoort bijna overal de optocht, veelal op zaterdag en zondag. Tijdens het carnaval regeert Prins Carnaval die in een aantal gevallen van de burgemeester voor de periode van het carnavalsfeest de sleutel van de stad ontvangt.
alternative label: carnaval
alternative label: Shrovetide

Casino
type: Concept
definition: Een casino is een uitgaansgelegenheid waar de bezoekers kunnen gokken door hun geld in te zetten op roulette, blackjack, fruitautomaten en andere kansspelautomaten in een poging om hun inzet te vergroten.
alternative label: casino's

Cavia
type: Concept
definition: Cavia's (Cavia) of Guinese biggetjes zijn een geslacht van de Zuid-Amerikaanse knaagdieren uit de familie Caviidae. Ze worden in bepaalde Zuid-Amerikaanse landen als voedseldier gefokt. In de meeste andere landen zijn ze tamelijk populaire, makkelijk te houden huisdieren.
alternative label: Guinees Biggetje

Chatbot
type: Concept
definition: Een chatterbot, chatbot of kortweg bot is een geautomatiseerde gesprekspartner. Het is dan ook een samenvoeging van het woord 'chat' en 'robot'. Chatbots zijn te vinden op websites en in Instant Messenger-programma’s. In het geval van Instant Messenger-programma's kan de chatbot worden toegevoegd als buddy.
alternative label: bot
narrower: Chatbot (EU)
narrower: Chatbot (US)

Chatbot (EU)
type: Concept

Chatbot (US)
type: Concept

Concert
type: Concept
definition: Een concert is een muziekuitvoering. De term is afgeleid van het Italiaans "concerto", afgeleid van het Latijn wat wedijveren, disputeren betekent. De term wordt zowel bij de klassieke muziek als in de populaire muziek gebruikt. Ook optredens van een fanfare of harmonie worden concert genoemd.
alternative label: concerten
alternative label: concertuitvoering
alternative label: optreden
alternative label: popconcert
alternative label: uitvoering

Crowdfunding
type: Concept
definition: Crowdfunding is een alternatieve wijze om een project of onderneming te financieren. Ondernemers gaan in de meeste gevallen naar een bank om een kredietaanvraag te doen en zo startkapitaal te verkrijgen. Crowdfunding verloopt echter zonder financiële tussenpersonen, maar zorgt voor direct contact tussen investeerders en ondernemers.
alternative label: publieksfinanciering

Cruise
type: Concept
definition: Cruisevaart is het deel van het personentransport over zee of rivier, waar het bedrijfsmodel gebaseerd is op het amuseren van de passagiers. Vaak gaat het om vakantiereizen waarbij de passagiers ook eten en overnachten op het schip. Onderweg worden havens met toeristische attracties aangedaan.
alternative label: cruise

Cryptovaluta
type: Concept
definition: Cryptogeld is waarde in de vorm van een bedrag in een cryptovaluta of -activa, of – met een Engels woord – cryptocurrency. De verschillende soorten valuta die er bestaan worden samen vaak aangeduid als cryptomunten. Cryptomunten worden vaak gezien als een soort digitale munteenheden, maar worden ook vaak omschreven als een soort obligaties, aandelen of handelswaar. Vanwege deze onduidelijkheid bestempelen sommigen cryptogeld als een geheel eigen klasse in de financiële wereld.
alternative label: cryptogeld
alternative label: cryptomunt
alternative label: cryptovaluta

Cultuur
type: Concept
definition: Cultuur is dat wat de mens schept en teweegbrengt, en verwijst naar menselijke activiteit en de symbolen die deze activiteit betekenis geven. Cultuur is een basisbegrip in de sociologie, de antropologie, de archeologie en de geschiedschrijving. Het begrip cultuur staat tegenover "natuur": dat wat spontaan en zonder menselijk toedoen is ontstaan of dat wat aangeboren is.
alternative label: cultural activity
alternative label: cultures

Cursus
type: Concept
definition: Een cursus is een lesperiode die over het algemeen een bepaald (leer)onderwerp behandelt. Een cursus wordt soms met een certificaat afgesloten. Is een cursus van lange duur, dan spreekt men wel van leergang. Degene die een cursus volgt, wordt een cursist genoemd. Cursussen kunnen beroepsmatig worden genoten, maar ook op allerlei hobbygebieden.
alternative label: onderwijs
alternative label: opleiding
alternative label: studie

Dating
type: Concept
definition: Daten is een aan het Engels ontleende term die verwijst naar het hebben of maken van afspraakjes met een kandidaat-partner. De essentie van daten is dat twee personen die elkaar nog niet of nauwelijks kennen, tijdens de date nader tot elkaar komen.

Den Haag
type: Concept
definition: Den Haag is de gebruikelijke naam voor 's-Gravenhage, een gemeente en stad in Nederland. Het is de hoofdstad van de provincie Zuid-Holland en huisvest de regering en het parlement van Nederland. Met 569.076 inwoners is het de op twee na grootste gemeente van Nederland en onderdeel van de metropoolregio Rotterdam Den Haag met ruim 2,4 miljoen inwoners. In officiële documenten als identiteitsbewijzen wordt 's-Gravenhage gebruikt, maar de gemeente hanteert Den Haag voor alle andere doeleinden.
alternative label: 's-Gravenhage
alternative label: gemeente 's-Gravenhage
alternative label: gemeente Den Haag
alternative label: Gemeente Den Haag

Dieet
type: Concept
definition: Een dieet of voedingswijze is voeding die aan een specifieke leefregel voldoet. Het oorspronkelijke Griekse diaita betekent "leefregel" in bredere zin.
alternative label: diëet
alternative label: dieetleer
alternative label: eetpatroon
alternative label: voedingswijze

Dienst
type: Concept
definition: Een dienst is een transactie waarbij een niet-fysiek product wordt geleverd. Zowel goederen als diensten worden in de economie vaak aangeduid als producten.

Dier
type: Concept
definition: Een gezelschapsdier, algemeen ook wel huisdier genoemd, is een gedomesticeerd dier dat door mensen wordt gehouden voor gezelschap, persoonlijk plezier of als onderdeel van het huishouden. In tegenstelling tot vee of lastdieren die men ook wel grote huisdieren noemt, worden gezelschapsdieren meestal niet gehouden voor praktische doeleinden, maar om de band die ze met hun eigenaren vormen. Bekende voorbeelden zijn honden en katten, sommige soorten knaagdieren zoals konijnen, hamsters en cavia's, en bepaalde soorten vogels, vissen en reptielen.
narrower: Dierenarts
alternative label: Animalia
alternative label: dieren
alternative label: dierenrijk
alternative label: dierenwereld
alternative label: diersoort
alternative label: diersoorten

Dieren
type: Concept
definition: De dieren (Animalia) vormen een rijk van meercellige levende wezens die tot de eukaryoten behoren. Dieren zijn een zeer diverse groep levensvormen, die zich voeden met organisch materiaal, zuurstof inademen, en zich in de regel geslachtelijk voortplanten. De meeste dieren kunnen zich actief voortbewegen en op prikkels uit hun omgeving reageren, die ze opvangen met hun zintuigen. Er zijn meer dan 1.5 miljoen diersoorten beschreven, waarvan ruim 1 miljoen tot de insecten behoren. De wetenschap die het dierenrijk bestudeert heet de zoölogie.
narrower: Dierenopvang

Dierenarts
type: Concept
definition: Een dierenarts behandelt zieke en gewonde dieren. Ook kan een dierenarts hulp bieden bij het voorkomen dat dieren ziek worden. Sommige dierenartsen behandelen uitsluitend of voornamelijk gezelschapsdieren, andere dierenartsen behandelen uitsluitend of voornamelijk paarden of landbouwhuisdieren. Deze artsen worden gewoonlijk veearts genoemd.

Dierenopvang
type: Concept

Dierenpark
type: Concept
definition: Een dierentuin, dierenpark, diergaarde of zoo is een verzameling levende, oorspronkelijk wilde dieren die in een vaak parkachtige omgeving in gevangenschap worden gehouden om het publiek de gelegenheid te geven ze te kunnen bekijken. De oudste nog bestaande dierentuin is de Tiergarten Schönbrunn (1752). Wereldwijd zijn er circa 3.000 dierentuinen, waarvan circa 250 in Europa. De dierentuinen in Europa dienen volgens Europese wetgeving over een Dierentuinvergunning te beschikken.

Dierenwinkel
type: Concept
definition: Een dierenwinkel of dierenspeciaalzaak is een onderneming die soms verschillende kleine soorten huisdieren (gezelschapsdieren) verkoopt, en daarnaast voeder ("dierenvoer") en een veelal grote variëteit aan toebehoren zoals kooien, diergeneesmiddelen, halsbanden of speeltjes.
alternative label: pet shop

Discount
type: Concept

Drogist
type: Concept
definition: Een drogist of drogiste is de zaakvoerder van een drogisterij, een handelszaak waar medicinale en chemische producten werden verkocht, zoals medicinale kruiden, vergiften, verf, cosmetica, oplosmiddelen, (kleur-)poeders en schoonmaakproducten. Uiteraard voegden zich daarbij de materialen voor het gebruik ervan, zoals borstels, zeven en emmers. De naam is afgeleid van het Middelnederlandse woord droge. Ook de woorden drugs, drogen en drogue zijn afgeleid van dit woord. Medicinale kruiden werden vroeger vaak eerst gedroogd.
alternative label: drogisterij

Duurzaam
type: Concept

Eindhoven
type: Concept
definition: Eindhoven is een stad en gemeente in het zuidoosten van de Nederlandse provincie Noord-Brabant, gelegen in de Brabantse Kempen. Het is naar inwonertal al sinds 1961 de vijfde gemeente van Nederland. Ze telt 249.873 inwoners op een grondgebied van 88,92 km². Ze omvat naast de gelijknamige stad Eindhoven tevens het dorp Acht en de uitbreidingslocatie Meerhoven.
alternative label: Eindhoven (gemeente)
alternative label: Eindhoven (plaats)
alternative label: gemeente Eindhoven
alternative label: Gemeente Eindhoven
alternative label: Lichtstad

EK voetbal
type: Concept
definition: Een Europees kampioenschap is een – vaak meerdaagse – competitie waarbij, vaak binnen verschillende disciplines en soms over verschillende disciplines heen, deelnemers elkaar bestrijden. De deelnemer die alle andere mededingers heeft verslagen wordt Europees kampioen genoemd. De afkorting daarvan is EK.

Elektronica
type: Concept
definition: Elektrisch apparaat waarvan de belangrijkste functionaliteit wordt geleverd door elektronische circuits.
alternative label: device

Energie
type: Concept
definition: Energie is een fundamentele natuurkundige grootheid, dat is een meetbare eigenschap van een natuurkundig verschijnsel. Een algemeen geldige korte definitie is niet mogelijk omdat van de vele soorten fysische verschijnselen, thermisch, mechanisch, straling, chemisch, enz. energie op veel verschillende manieren gemeten wordt. Al deze metingen hebben gemeen dat de resultaten uitgedrukt kunnen worden in dezelfde natuurkundige eenheid.
narrower: Energieleverancier

Energieleverancier
type: Concept
definition: Een energieleverancier is een energiebedrijf dat energie produceert of inkoopt bij een energieproducent en deze verkoopt aan eindverbruikers. Energie wordt geleverd in de vorm van elektriciteit, gas of warmte. In verband met de liberalisering van de energiemarkt mogen energieleveranciers en energieproducenten in Europa op grond van Europese regelgeving geen eigenaar zijn van het net waarover de energie wordt getransporteerd. Het elektriciteitsnet, gasnet en warmtenet zijn in eigendom van en worden beheerd door netbeheerders.

Entertainment nieuws
type: Concept

Eredivisie voetbal
type: Concept
definition: De Eredivisie is de hoogste voetbalafdeling in Nederland in de betaalde mannencompetitie. In de Eredivisie wordt gestreden om het landskampioenschap betaald voetbal. In 2024 werd de competitie door de IFFHS uitgeroepen tot nummer tien van sterkste nationale competities ter wereld en de achtste sterkste van Europa. In 2025 stond de Eredivisie op plek zes van sterkste Europese competities volgens de UEFA-coëfficiënten. De competitie heet sinds 2025 officieel VriendenLoterij Eredivisie, naar de hoofdsponsor VriendenLoterij.

Escaperoom
type: Concept
definition: Een escaperoom is een interactief spel op een fysieke locatie waarbij een groep mensen samen puzzels, raadsels en uitdagingen ontdekken en proberen op te lossen binnen een bepaalde tijd om zo uit de kamer te kunnen ontsnappen. Het is een misvatting dat men bij escaperooms altijd wordt opgesloten in een kamer.

Eten
type: Concept
definition: Eten is de activiteit van het tot zich nemen van voedsel. De term eten wordt ook gebruikt voor de substantie die gegeten wordt.
narrower: Foodhall
narrower: Maaltijdbox
narrower: Restaurant
narrower: Supermarkt
narrower: Wijn

Evenement
type: Concept
definition: Een evenement is een verplaatsbare georganiseerde gebeurtenis waarbij een veelheid aan mensen betrokken is. Meestal is die gebeurtenis publiek, maar ze kan ook besloten zijn, bijvoorbeeld een bedrijfsevenement.
narrower: Beurs
narrower: Carnaval
narrower: Festival
narrower: Koningsdag
narrower: Markt

Festival
type: Concept
definition: Een festival is een eendaags of meerdaags, vaak periodiek weerkerend evenement, bedoeld voor groepen geïnteresseerden rond een bepaald onderwerp. Dit kan kunstzinnig zijn, zoals muziekfestivals in alle mogelijke genres, een filmfestival of theaterfestival. Ook dans, literatuur en beeldende kunst kunnen een thema zijn. Een festival kan als thema eten of drinken hebben, wetenschap, humor of gewijd zijn aan ambachten. Het kan religieus van aard zijn of gericht op een bepaalde gemeenschap of cultuur. Het is een feestelijk gebeuren voor gelijkgestemden. Kenmerkend is dat op het programma meerdere optredens of activiteiten staan. Een festival kan een beperkt lokaal feest zijn maar evengoed grootschalig en honderdduizenden bezoekers uit verschillende landen aantrekken. Er is vaak ook een festivalcamping waar bezoekers met een kaartje voor alle dagen van het festival kunnen kamperen.
narrower: Bierfestival
narrower: Muziekfestival

Fiets
type: Concept
definition: Een fiets is een voertuig dat oorspronkelijk met spierkracht werd aangedreven. Een basisfiets bestaat uit twee wielen, een frame, een zadel, een stuur en een trapas met pedalen.

Film
type: Concept
alternative label: movie

Financieel nieuws
type: Concept

Fitness
type: Concept

Folder
type: Concept
definition: Een folder of vouwblad is drukwerk dat bestaat uit één blad dat een of meer malen is gevouwen, of meerdere bladen die eenmaal zijn gevouwen, vaak tot een boekje dat niet groter is dan A5. Een folder onderscheidt zich van ander drukwerk in boekvorm doordat het meerdere pagina's heeft maar niet is gebonden. Ook een ongevouwen blad bestaande uit slechts 1 vel papier wordt vaak folder genoemd, hoewel hiervoor ook de benamingen flyer en strooibiljet gangbaar zijn. Het huis aan huis en op straat verspreiden van strooibiljetten of folders wordt 'folderen' genoemd, zoals het verspreiden van politieke boodschappen in verkiezingstijd of van reclame voor een artikel of een winkel.
alternative label: flyer
alternative label: folderen
alternative label: vouwblad

Foodhall
type: Concept

Friesland
type: Concept
definition: Friesland [ˈfrislɑnt] ; officieel, Fries: Fryslân [ˈfrislɔ̃ːn] is een provincie in Noord-Nederland.
narrower: Waddeneiland

Fysiotherapie
type: Concept
definition: Fysiotherapie of kinesitherapie is een paramedisch beroep dat zich bezighoudt met de behandeling van klachten aan het steun- en bewegingsapparaat van de mens. In Nederland spreekt men van fysiotherapie, in België van kinesitherapie.

Geestelijke gezondheidszorg
type: Concept
definition: De geestelijke gezondheidszorg (ggz) is, als vakgebied van de gezondheidszorg, een toegepaste wetenschap die zich bezighoudt met de psychische gezondheid van mensen. Naast onderzoek en studie van deze gezondheid omvat ggz ook toepassing van die kennis om de geestelijke gezondheid en kwaliteit van leven van de mens te bevorderen en/of herstellen. Ook streeft de ggz naar het voorkómen van psychische problemen.
alternative label: ggz

Gehandicaptenzorg
type: Concept

Geld
type: Concept
definition: Het geld is een eenheid om waarde uit te drukken en bestaat enerzijds uit publiek geld voor het chartaal betalingsverkeer en anderzijds uit privaat geld voor het giraal betalingsverkeer. Geld heeft als functie een wettig betaalmiddel te zijn voor het betalen van goederen & diensten en kan door de bevolking worden ingezet als betrouwbaar spaarmiddel.
narrower: Bankieren
narrower: Betaaldienst
narrower: Crowdfunding
narrower: Cryptovaluta
narrower: Lenen
narrower: Loterij
narrower: Verzekering

Gemeente
type: Concept
definition: Een gemeente is een territoriale bestuurlijke eenheid met een eigen lokaal bestuur. De gemeente is een overheid. In veel landen vormt de gemeente de laagste algemene bestuurslaag uit de politieke bestuursstructuur. Een gemeente omvat over het algemeen een of meer woonplaatsen met het omliggende buitengebied. Het gemeentebestuur bestaat uit een gekozen gemeenteraad en een uitvoerend bestuur onder leiding van een burgemeester, vaak samen met wethouders of schepenen.

Geschiedenis
type: Concept
definition: Geschiedenis.
alternative label: historie

Geschiedenismuseum
type: Concept

Gezin
type: Concept
narrower: Baby
definition: Gezin is de term voor alle samenlevingsvormen die een herkenbare sociale eenheid zijn, met al dan niet verwante personen die duurzame en affectieve banden hebben en elkaar onderling steun en verzorging verlenen.
alternative label: cereal packet families
alternative label: cereal packet family
alternative label: conjugal families
alternative label: conjugal family
alternative label: elementary families
alternative label: elementary family
alternative label: nuclear families

Gezondheid
type: Concept
definition: Gezondheid is een toestand van algeheel welbevinden, waarin er geen sprake is van lichamelijk letsel of ziekte. De definitie van de Wereldgezondheidsorganisatie (WHO) uit 1948 luidt:Gezondheid is een toestand van volledig lichamelijk, geestelijk en maatschappelijk welzijn, en niet slechts de afwezigheid van ziekte of andere lichamelijke gebreken.
alternative label: vitaliteit
related: Gezondheidszorg
narrower: Apotheek
narrower: Drogist
narrower: Huisarts
narrower: Ziekenhuis

Gezondheidszorg
type: Concept
definition: De gezondheidszorg in een bepaald land is het geheel aan activiteiten, aangestuurd en grotendeels gefinancierd door de overheid, dat gericht is op de verbetering van de gezondheid van de bevolking. De gezondheidszorg past geneeskundige kennis toe om de gezondheid van mensen te verbeteren, ziekte te voorkomen of te genezen, en om het lichamelijk en psychisch functioneren te verbeteren. Middels zorgevaluatie kan de gezondheidszorg getoetst worden.
narrower: Fysiotherapie
narrower: Geestelijke gezondheidszorg
narrower: Huisarts
narrower: Ziekenhuis

Goed Doel
type: Concept
definition: Een goed doel is een zaak van algemeen belang waar men geld of goederen aan kan geven. Ook kan men als vrijwilliger tijd besteden aan werkzaamheden ten behoeve van een goed doel. In het verlengde daarvan wordt de term 'goed doel' gebruikt voor charitatieve instelling: een organisatie die zich inzet op filantropisch vlak. De laatstgenoemde term kan ook worden gebruikt voor fondsen die eigen inkomsten hebben en dus geen geld werven bij het publiek.
alternative label: crowdfunding

Hardlopen
type: Concept
definition: Hardlopen, in Vlaanderen ook lopen genoemd, is een vorm van atletiek. Hier kunnen mensen recreatief dan wel in wedstrijdverband aan deelnemen. Dit artikel handelt over hardlopen in de recreatieve sfeer.

Hitlijst
type: Concept
definition: Een hitparade of hitlijst is een lijst waarop in de juiste volgorde de bestverkochte of meest gedraaide singles of albums van een bepaalde periode zijn gerangschikt: de hits. Het Amerikaanse tijdschrift Billboard publiceerde al in 1914 lijsten als "Popular Songs Heard in Vaudeville Theaters Last Week" en "The Billboard's Song Hints", en sinds 1958 de Billboard Hot 100. In Nederland zond de VARA in het programma van Pete Felleman een hitparade uit in 1949. Daarin draaide hij uitsluitend Amerikaanse hits. Tuney Tunes publiceerde maandelijks de Tip-Toppers in de rubriek Radio Kruimels vanaf oktober 1947. Meestal werden er geen uitvoerende artiesten vermeld.

Hogeschool
type: Concept
definition: Het hoger beroepsonderwijs, dat wordt afgekort als hbo, is een onderwijsvorm binnen het hoger onderwijs in Nederland en Suriname.
alternative label: hbo

Hotel
type: Concept
definition: Een hotel is een dienstverlenend bedrijf waar iemand tegen betaling kan overnachten of onderdak vinden. In tegenstelling tot gelegenheden voor logies en ontbijt hebben hotels voorzieningen voor tientallen tot duizenden gasten. Jeugdherbergen worden over het algemeen niet als hotels aangemerkt, vanwege de mogelijkheid tot het delen van kamers met onbekenden en een daaruit volgend gebrek aan privacy.

Huis
type: Concept
definition: Een huis, woning of (Vlaams) woonst is een bouwwerk waarin mensen kunnen wonen. Hier gaat het om een gebouw dat muren rondom een binnenruimte heeft, evenals een dak. Een huis biedt bescherming tegen neerslag, wind, extreme temperaturen en tegen mogelijk binnendringende mensen of dieren. De binnenruimte in het huis is meestal verdeeld in verschillende kamers waaronder een keuken. Veel huizen hebben ook een gang, een trap, een zolder of een kelder. Vaak hebben mensen bij het huis een tuin of een erf. Luxueuzere huizen hebben een garage, of zelfs een bijkeuken.
alternative label: woning
narrower: Huurwoning
narrower: Makelaar

Huisarts
type: Concept
definition: Huisarts of huisdokter is een gespecialiseerde arts die perifeer – buiten de academische ziekenhuizen – werkt, maar niet in een ziekenhuis. In het algemeen wordt de huisarts door mensen met gezondheidsproblemen in de ruimste zin als eerste aangesproken. De huisarts is zodoende de medisch specialist met als vak generalisme.
alternative label: dokter

Huisdier
type: Concept
definition: Een gezelschapsdier, algemeen ook wel huisdier genoemd, is een gedomesticeerd dier dat door mensen wordt gehouden voor gezelschap, persoonlijk plezier of als onderdeel van het huishouden. In tegenstelling tot vee of lastdieren die men ook wel grote huisdieren noemt, worden gezelschapsdieren meestal niet gehouden voor praktische doeleinden, maar om de band die ze met hun eigenaren vormen. Bekende voorbeelden zijn honden en katten, sommige soorten knaagdieren zoals konijnen, hamsters en cavia's, en bepaalde soorten vogels, vissen en reptielen.
alternative label: gezelschapsdier
alternative label: gezelschapsdieren
alternative label: huisdieren

Huisdierverzekering
type: Concept

Huur
type: Concept
definition: Huur is het gebruik van goederen die aan een ander toebehoren in ruil voor een vergoeding. Het betaalde bedrag wordt eveneens huur genoemd.
narrower: Aanhanger
narrower: Autoverhuur
narrower: Caravan
narrower: Huurwoning

Huurwoning
type: Concept
definition: Een huurwoning is een woning die de bewoner huurt van de eigenaar, veelal een woningcorporatie of een particulier.

ICT
type: Concept
definition: Verzamelnaam voor technologieën op het gebied van informatie- en communicatie.
alternative label: IT

ICT tijdschrift
type: Concept

Internet abonnement
type: Concept
definition: Het internet is een wereldwijd openbaar netwerk van computernetwerken, waarvan de afspraken worden beschreven in de Request for Comments die worden beheerd door de Internet Engineering Task Force. Om het internet goed te laten werken, zijn afspraken gemaakt over protocollen voor gegevensuitwisseling tussen computers. Een van die protocollen is het Internetprotocol (IP).

Jeugdzorg
type: Concept
definition: Jeugdzorg, ook wel jeugdhulpverlening en in de huidige Belgische zowel als de Nederlandse wet jeugdhulp genoemd, is hulp en ondersteuning die wordt geboden aan kinderen, jongeren, en vaak ook hun netwerk en familie, en de voorzieningen die daarvoor beschikbaar zijn. Meestal gaat het om professionele maatschappelijke zorg voor kinderen en jongeren met een specifieke problematiek, maar ook initiatieven door vrijwilligers kunnen onder deze noemer vallen.
alternative label: jeugdhulp

Juwelier
type: Concept
definition: Een juwelier is een detailhandelszaak die gespecialiseerd is in de verkoop van sieraden en horloges. Juwelierszaken bieden diverse diensten aan, zoals reparaties, aanpassingen, restauratie, het ontwerpen en vervaardigen van sieraden.
related: Armband
related: Sieraad

Kamperen
type: Concept
definition: Kamperen is een vorm van openluchtrecreatie waarbij men in een tent, caravan, camper, tenthuisje of ander relatief eenvoudige recreatiewoning op een buitenterrein verblijft. Dit is meestal één of meerdere nachten.

Kasteel
type: Concept
definition: Een burcht of slot is een versterkte woning van een edelman en zijn familie opgericht in de middeleeuwen. Als extra versterking van de (wal)burcht worden burchten meestal omringd door een droge of natte gracht, een aarden wal of een zware stenen ommuring. Een van de oudste nog bestaande voorbeelden in Nederland is de Burcht van Leiden. Voor België is het Gravensteen een goed voorbeeld.
alternative label: burcht
alternative label: slot
alternative label: vesting

Kennis
type: Concept
definition: Kennis is dat wat geweten wordt, wat geleerd is en in het geheugen opgeslagen, plus dat waar een individu inzicht in heeft. Kennis omvat informatie, beschrijvingen hiervan en vaardigheden die door ervaring of opleiding zijn verkregen. In de kentheorie of epistemologie wordt onderzocht wat kennis is en of aanspraken op kennis gerechtvaardigd zijn. In de loop van de tijd zijn er dan ook wisselende ideeën ontwikkeld over wat er te weten valt en in welke mate er sprake moet zijn van twijfel.
alternative label: awareness
alternative label: knowing

Keuken
type: Concept
definition: Een keuken is een ruimte of plaats in een gebouw waarin mensen hun voedsel bereiden of laten bereiden. In enge zin wordt in bepaalde omstandigheden niet de ruimte, maar de in de ruimte opgestelde kasten, meubilair, aanrecht en apparatuur bedoeld. Op een schip heet het keukengedeelte kombuis.

Kijk
type: Concept
narrower: Bioscoop
narrower: Film
narrower: Streamingdienst
narrower: TV
narrower: TV-serie
definition: Zien, zicht, of visuele waarneming, is het vermogen om kleuren, objecten en relaties waar te nemen in de zichtbare ruimte, met behulp van licht, ogen, hersenen en (oog)motoriek. Wat we zien wordt vastgelegd in een mentale representatie.
alternative label: kijken

Kleding
type: Concept
definition: Het dragen van kleding in het algemeen of van speciaal ontworpen kleding kan diverse redenen hebben:Het bieden van bescherming tegen koude, warmte of zonnestraling. Het bieden van bescherming bij bepaalde activiteiten. Het herkenbaar maken van het uitoefenen van een beroep of bedrijfsimago. Het uitdrukken van status. Het voldoen aan maatschappelijke eisen en verwachtingen (kledingvoorschrift). Het verhullen van lichaamsdelen die misvormd of beschadigd zijn. Het zich onderscheiden van anderen. Het er representatief of aantrekkelijk eruitzien.
alternative label: kleren
narrower: Kledingmerk

Kledingmerk
type: Concept

Kledingwinkel
type: Concept

Koningsdag
type: Concept
definition: Koningsdag, eerder Prinsessedag (1885-1890) en Koninginnedag (1891-2013), is sinds de regeringsperiode van koningin Juliana een nationale feestdag in het Koninkrijk der Nederlanden ter ere van de verjaardag van het staatshoofd. In alle delen van het koninkrijk geldt dit voor de meeste werknemers als vrije dag en wordt het gevierd met verschillende festiviteiten, waaronder vrijmarkten, muziekfestivals en het dragen van oranje kleding. Vanaf 1981 brengen de koning en/of koningin op deze dag een ceremonieel bezoek aan een of meer gemeenten van het land.
alternative label: Koninginnedag
alternative label: Koningsdag (Nederland)

Koningshuis
type: Concept
definition: Een koningshuis is een familie waarbinnen het koningschap wordt overgeërfd.

Kraamzorg
type: Concept
definition: Kraamzorg is geschoolde zorg voor, tijdens en na een bevalling voor de kraamvrouw en haar gezin.

Kringloop
type: Concept
definition: Een kringloopcentrum, kringloopwinkel, kringloopbedrijf of – in België – kringwinkel is een organisatie die hergebruik van goederen verzorgt.
alternative label: kringloopbedrijf
alternative label: kringloopcentrum
alternative label: kringwinkel
alternative label: tweedehandswinkel

Kunst
type: Concept
definition: Kunst is de bewuste creatie van iets moois of betekenisvols met behulp van vaardigheid en verbeelding. Het omvat een breed scala aan menselijke activiteiten, waaronder schilderen, tekenen, grafiek, beeldhouwen, mediakunst, theater, dans, muziek en zang, fotografie, film, architectuur, literatuur en poëzie.
related: Kunstmuseum

Kunstmuseum
type: Concept
narrower: Kunst

Lenen
type: Concept
definition: Een lening is een geldbedrag dat door een partij wordt verstrekt aan een andere partij op voorwaarde dat het later terug wordt betaald. De uitlener krijgt daarmee een vordering op de lener en wordt schuldeiser. De lener krijgt een schuld en wordt schuldenaar. Het aangaan van een lening is een overeenkomst, namelijk een leenovereenkomst, die zelf ook wel lening wordt genoemd. Als gesproken wordt over de aan- of verkoop van een lening wordt met lening de vordering bedoeld; de schuldenaar krijgt dan een andere schuldeiser.

Liefde
type: Concept
definition: Liefde is diepe acceptatie van en genegenheid voor, welgezindheid tot of toewijding voor een ander, of eventueel zichzelf. Het kan ook betrekking hebben op een dier, zaak of voorwerp. Eveneens kan liefde gevoeld worden voor handelingen, zoals een ambacht, vak, sport en bezigheid. Vaderlandsliefde is een voorbeeld van liefde voor een abstract verschijnsel, zo ook kan liefde ervaren worden voor de eigen religie en voor natuur. De betekenissen die aan het begrip 'liefde' gegeven worden zijn sterk cultureel en maatschappelijk geïnspireerd. De context bepaalt ook de betekenis, houden van pindakaas is een andere emotie dan houden van je kind.
narrower: Dating

Loterij
type: Concept
definition: Een loterij is een kansspel waarbij de deelnemers loten kopen van een bepaalde waarde.

Luisterboek
type: Concept
definition: Een luisterboek, ook audioboek en vroeger gesproken boek of radioboek genoemd, is een geluidsopname van een voorgelezen boek of een ingesproken reeks van hoorcolleges gegeven door docenten. In het commerciële verkeer wordt een luisterboek uitgebracht op compact disc, of als bestanden die na betaling via internet kunnen worden gedownload. Daarnaast zijn via het internet bestanden in omloop die gratis zijn te downloaden, meestal in mp3-formaat. Het gaat dan om oude boeken, die vrij zijn van auteursrechten, of boeken die door de schrijver beschikbaar zijn gesteld. Ook zijn er in de diverse app-stores speciale apps verkrijgbaar waarmee luisterboeken kunnen worden beluisterd via een smartphone of tablet, zoals bv. Storytel.
alternative label: audioboek
alternative label: radioboek

Maaltijdbox
type: Concept
definition: Een maaltijdbox is een boodschappenpakket dat recepten en ingrediënten bevat om verschillende gerechten mee te kunnen bereiden. Levering gebeurt op basis van een abonnement, bijvoorbeeld eens per week of om de week.

Makelaar
type: Concept
definition: Een makelaar of tussenhandelaar is een beëdigd per­soon die be­roeps­hal­ve over­een­kom­sten sluit na­mens per­so­nen bij wie hij niet in dienst is. Een makelaar bemiddelt veelal bij koop en verkoop, huur en verhuur van huizen, kantoren, roerende zaken, verzekeringen, op de goederentermijnmarkt of ander roerend, onroerend of registergoed. Daarnaast regelt een makelaar contracten en (ver)koopafspraken. Een groot deel van het werk bestaat uit het zoeken van een geschikte partij om dat bepaalde goed eenmalig mee te verhandelen. De makelaar is dus slechts tussenpersoon en is werkzaam krachtens een overeenkomst van bemiddeling. Het vak wordt de 'makelaardij' genoemd.

Mantelzorg
type: Concept
definition: Mantelzorg is de zorg voor chronisch zieken, gehandicapten en hulpbehoevenden door naasten: familieleden, vrienden, kennissen en buren. Kenmerkend is de reeds bestaande persoonlijke band tussen de mantelzorger en zijn of haar naaste. Daarnaast gaat het om langdurige zorg die onbetaald is.

Markt
type: Concept
definition: Een markt is een verkoopgelegenheid met kramen. Een markt kan overdekt in een hal gehouden worden, maar wordt in de Lage Landen veelal in de buitenlucht georganiseerd, zoals op een plein of in een straat. Volgens ter plaatse geldende marktregels proberen marktlieden op (huur)kramen of vanuit (eigen) verkoopwagens waar aan de man te brengen. Het woord markt is afgeleid van het Latijnse woord mercatus, hetgeen markt en handel betekent. De handelaar die op een markt staat is een marktkoopman. Een koopman met een kraam, al of niet op een markt, is een kramer.

Marktplaats
type: Concept
definition: Een marktplaats is een plek waar vraag en aanbod bij elkaar komen. Oorspronkelijk ging het om een fysieke locatie als een plein of terrein in een dorp of stad waar marktkooplieden hun waren uitstallen en verkopen aan het publiek, ook wel een marktplein of kortweg markt genoemd. Sinds de opkomst van eerst gedrukte media en het internet zijn er ook marktplaatsen in kranten en tijdschriften en virtueel via websites.
alternative label: bazaar
alternative label: market
alternative label: public market

MBO
type: Concept
definition: Het middelbaar beroepsonderwijs is een onderwijsvorm in het Nederlandse onderwijs.
alternative label: mbo

Merchandise
type: Concept
definition: Merchandising is het commercieel exploiteren van de populariteit van een merk of van bekende personen, zoals filmsterren, entertainers en sporthelden, evenals van figuren uit films, stripverhalen, games en televisieprogramma's.
alternative label: merchandise

Messaging
type: Concept
definition: Instant messaging, ook wel afgekort als IM, is een benaming voor technologieën waarbij het de bedoeling is dat berichten zeer snel worden overgebracht, zoals bij chatten. Dit in tegenstelling tot e-mail, waarbij de snelheid van overbrengen iets lager kan zijn.
alternative label: chat
alternative label: IM
alternative label: Instant Messaging
alternative label: messaging
alternative label: text chat

Meubel
type: Concept
definition: Meubilair is een verzamelnaam voor allerhande meubels die worden gebruikt in en om het huis, een kasteel of een kerk. Meubels zijn inrichtingsvoorwerpen of huisraad zoals tafels, stoelen, kasten en bedden en vaak ontworpen door meubelontwerpers en gemaakt door meubelmakers en meubelfabrikanten. Het woord meubel is, via het Oudfranse 'mueble', afkomstig van het Latijnse woord 'mobilis', waar ook het woord 'mobiel' van afstamt. Het Frans aandoende woord 'meubilair' is in het Frans ongebruikelijk.
alternative label: meubilair
narrower: Badkamer
narrower: Bed
narrower: Keuken
narrower: Tuinmeubel

Monument
type: Concept
definition: Een monument is een overblijfsel van kunst, cultuur, architectuur of nijverheid dat van algemeen belang wordt geacht vanwege de historische, volkskundige, artistieke, wetenschappelijke, industrieel-archeologische of andere sociaal-culturele waarde.
alternative label: cultureel erfgoed
alternative label: cultureel goed
alternative label: erfgoedobject

Museum
type: Concept
definition: Een museum is een openbare instelling gericht op het onderzoeken, verzamelen, bewaren, interpreteren en tentoonstellen van materieel en immaterieel erfgoed. Volgens de in 2023 door de internationale museumraad ICOM gekozen definitie zijn musea bovendien permanent, zonder winstoogmerk, in dienst van de samenleving, toegankelijk en inclusief, bevorderen ze diversiteit en duurzaamheid, werken en communiceren ze ethisch, professioneel en met participatie van gemeenschappen, en bieden ze een verscheidenheid aan ervaringen met het oog op educatie, genoegen, reflectie en kennisuitwisseling.
alternative label: expo
alternative label: expositie
alternative label: tentoonstelling
narrower: Geschiedenismuseum
narrower: Kunstmuseum
narrower: Themamuseum

Musical
type: Concept
definition: Musicals kunnen toneeluitvoeringen zijn (theatermusical) of films (filmmusical). Buiten de context van films is het soms de gewoonte om met 'musical' zonder nadere aanduiding een theatermusical te bedoelen.

Muziek
type: Concept
definition: Muziek of toonkunst is de kunstzinnige schikking en combinatie van de klanken van muziekinstrumenten en de menselijke stem om schoonheid van vorm dan wel uitdrukking van emotie te bereiken. Het woord 'muziek' is afgeleid van het Griekse μουσική (mousikè), 'kunst van de muzen'.

Muziekfestival
type: Concept
definition: Een muziekfestival is een – doorgaans binnen een bepaald tijdsbestek terugkerend – muzikaal evenement waarbij soms een, maar over het algemeen meerdere artiesten live optreden voor een doorgaans wat groter publiek. Dit kan een popfestival zijn, maar bijvoorbeeld ook een festival waarbij jazz of klassieke muziek centraal staat.
alternative label: popfestival

Muziekles
type: Concept

Nachtmode
type: Concept
definition: Nacht- en huiskleding is kleding die meestal 's nachts of 's avonds gebruikt wordt om op de bank door te zakken voor de tv, of het huishouden te doen. Het is kleding waarin je je niet aan anderen wilt vertonen, vandaar dat het meestal slechts thuis en in besloten kring gedragen wordt. Ook in huiselijke kring is er een onderscheid tussen nachtkleding en comfortabele kleding waarin je kunt relaxen.
alternative label: slaapkleding

Natuur
type: Concept
definition: De natuur is de inhoud en werking van het heelal, zowel niet-levend als levend. De natuur wordt met name bestudeerd door de natuurwetenschappen.
alternative label: milieu
narrower: Dieren
narrower: Natuureducatie
narrower: Natuurgebied
narrower: Natuurmuseum
narrower: Natuurvereniging
narrower: Plant
narrower: Wandelroute

Natuureducatie
type: Concept
definition: Natuur- en milieueducatie is een educatief vak op het gebied van natuur en milieu.
alternative label: milieueducatie
alternative label: natuureducatie
alternative label: natuuronderwijs
alternative label: NME-centra
alternative label: NME-centrum

Natuurgebied
type: Concept
definition: Een natuurgebied is een gebied met opvallende eigenschappen als het gaat om flora, vegetatie, fauna, geologische, geomorfologische of landschappelijke gesteldheid, zoals dit tot uiting komt in een grote uitgestrektheid, verscheidenheid aan landvormen en biodiversiteit. Natuurgebieden worden gekenmerkt door soorten en levensgemeenschappen waarvoor in agrarische, stedelijke en industriële cultuurlandschappen nog maar weinig plaats is overgebleven.

Natuurkunde
type: Concept
definition: Natuurkunde of fysica is de wetenschap die zich bezighoudt met de algemene eigenschappen van materie, straling en energie, evenals het gedrag ervan in de ruimte en de tijd. Fysici onderzoeken fenomenen zoals kracht, beweging en evenwicht, warmte, licht, geluid, magnetisme en elektriciteit. Natuurkunde is een van de meest fundamentele wetenschappelijke disciplines, en haar belangrijkste doel is te verklaren hoe de wereld, vanaf het universum tot de kleinste deeltjes, werkt en in elkaar steekt.
alternative label: fysica
alternative label: natuurwetenschap

Natuurmuseum
type: Concept
definition: Een natuurmuseum is een museum dat gespecialiseerd is in de natuur, veelal over planten en dieren. Een natuurmuseum heeft een (grote) collectie opgezette dieren van voorbeelden van vlinders, vaak veel zoogdieren tot een skelet van een dinosauriër. Ook de prehistorie en fossielen zijn vaak aanwezig.
alternative label: natuurhistorisch museum

Natuurstichting
type: Concept

Natuurvereniging
type: Concept
definition: Een natuurvereniging probeert door werkzaamheden in het landschap de natuurwaarden te beschermen, te herstellen of nieuwe kansen te bieden aan natuur. Daarnaast probeert een natuurvereniging zo veel mogelijk mensen van het nut en de noodzaak van natuurbehoud te overtuigen.

Nederland
type: Concept
definition: Nederland is een van de vier landen binnen het Koninkrijk der Nederlanden. Voor het overgrote deel ligt het in het noordwesten van Europa. Drie bijzondere gemeenten liggen in het werelddeel Amerika, in de Caribische Zee. Europees Nederland wordt in het zuiden begrensd door het in 1830 afgescheiden België, langs de oostgrens door Duitsland en aan de west- en noordzijde door de Noordzee.
alternative label: de nederlanden
alternative label: holland
alternative label: netherlands
alternative label: NL
narrower: Zeeland
hoofdstad: amsterdam
has geometry: Polygon
  subject: Geometrie
  description: Polygoon geometrie.

Netbeheerder
type: Concept
definition: In de energievoorziening is een netbeheerder een onafhankelijk nutsbedrijf dat een transportnetwerk voor energie beheert. Netbeheerders zijn te onderscheiden in enerzijds de beheerder van het landelijk hoogspanningsnet en anderzijds de regionale netbeheerders die de energie van het hoofdnet naar de eindverbruikers transporteren. In Nederland is de beheerder van het hoogspanningsnet TenneT en van het aardgasnet de Nederlandse Gasunie. In België zijn dat Elia voor het hoogspanningsnet en Fluxys voor het gasnet.
alternative label: energienetbeheerder

Nieuws
type: Concept
definition: Nieuws omvat alle informatie van een zeker algemeen belang die tot dusver aan publieke waarneming was onttrokken. Het gaat daarbij vaak over een recente maatschappelijke gebeurtenis met een zekere impact, die in de actualiteit is gekomen omdat er collectieve belangstelling voor bestaat. De aanduiding "nieuws" kan echter ook betrekking hebben op gebeurtenissen uit het verdere verleden die niet eerder als zodanig werden ontsloten voor een brede kring van belangstellenden. Het kan daarnaast ook gaan om een onthulling van feiten die velen interessant vinden, of om publiciteit die is veroorzaakt door een informatielek.
alternative label: bulletin
alternative label: dagblad
alternative label: journaal
alternative label: krant
alternative label: nieuwsblad
alternative label: streekblad

Occasion
type: Concept
definition: Een occasion of okkasie is een tweedehands auto die te koop staat en waarvoor al eerder een kentekenbewijs is afgegeven aan een eerdere eigenaar.
alternative label: okkasie
alternative label: tweedehands auto

Onderwijs
type: Concept
definition: Onderwijs is het overbrengen van kennis, vaardigheden en attitudes, waarbij er wordt toegewerkt naar vooraf vastgelegde leerdoelen. Daarbij houdt men rekening met de beginsituatie van de leerling, volgt men een onderwijsstrategie, en worden de leerresultaten geëvalueerd. Dit gebeurt door toetsing van de leerling, en door evaluatie door de docent zelf en door collega's. Onderwijs wordt, binnen een door de overheid bepaalde structuur, gegeven door personen die daarvoor speciaal zijn opgeleid, met name onderwijzers, leraren en andere docenten.
narrower: Cursus
narrower: Opleiding
narrower: School
alternative label: school
alternative label: studie
alternative label: training

Onderzoek
type: Concept
definition: Alles over onderzoek.
alternative label: statistieken

Ontspanning
type: Concept
alternative label: ontspanning
alternative label: recreant
definition: Vrijetijdsactiviteit die spanning en stress vermindert.

Open Source
type: Concept
definition: Open source is software die vrij beschikbaar wordt gesteld voor mogelijke aanpassingen en herdistributie, ook in de vorm van broncode. De licentievoorwaarden omvatten toestemming om de broncode, ontwerpdocumenten of inhoud van het product te gebruiken en in te zien. Het open source-model is een gedecentraliseerd softwareontwikkelingsmodel dat open samenwerking stimuleert. Een belangrijk principe van open source-softwareontwikkeling is peer-productie, waarbij producten zoals broncode, blauwdrukken en documentatie vrij beschikbaar zijn voor het publiek. De open source-beweging in software is ontstaan ​​als reactie op de beperkingen van propriëtaire code. Het model wordt gebruikt voor projecten zoals open source e-commerce, open source geschikte technologie en open source geneesmiddelenonderzoek.

Opinie
type: Concept
definition: Journalistiek die geen aanspraak maakt op objectiviteit.

Opleiding
type: Concept
definition: Een opleiding is een onderwijsprogramma dat ingericht is om de benodigde kennis en vaardigheden voor een beroep of bedrijf over te brengen. Vaak is de naam van de opleiding gelijk aan de naam van het beroep waarvoor wordt opgeleid. Een opleiding kan opgebouwd zijn met verschillende cursussen of vakken die ieder een afzonderlijke thematiek bespreken. Een opleiding wordt doorgaans afgesloten met een attest, diploma of getuigschrift. De kwaliteit van opleidingen in het hoger onderwijs wordt gecontroleerd door de Nederlands-Vlaamse Accreditatieorganisatie.
alternative label: onderwijs
alternative label: studie
narrower: Hogeschool
narrower: MBO
narrower: Universiteit

Opslag
type: Concept
definition: Opslaan van goederen in een opslagplaats.

Opticien
type: Concept
definition: Een opticien is iemand die gespecialiseerd is in het aanmeten van en adviseren over brillen, contactlenzen en andere ‘correctieve optica’. De opticien is vooral werkzaam binnen de detailhandel.
alternative label: Optieker

Ouderenzorg
type: Concept
definition: Ouderenzorg is een breed begrip waarmee de zorg voor ouderen en bejaarden wordt bedoeld.

Outdoor
type: Concept
definition: Buitenrecreatie of outdoor verwijst naar recreatie die buiten plaatsvindt, meestal in de natuur. De activiteiten die onder buitenrecreatie vallen, variëren afhankelijk van de fysieke omgeving waarin ze worden uitgevoerd. Deze activiteiten kunnen bestaan ​​uit vissen, jagen, backpacken, wandelen en paardrijden – en kunnen individueel of in groepsverband worden gedaan. Buitenrecreatie is een breed begrip dat een gevarieerd scala aan activiteiten en landschappen omvat.

OV
type: Concept
definition: Openbaar vervoer is personenvervoer dat openbaar toegankelijk is, dat wil zeggen dat iedereen van de vervoerdienst gebruik kan maken. Twee veel voorkomende voorwaarden: de reiziger betaalt het geldende tarief en volgt de gebruikelijke fatsoensregels op. Openbaar vervoer is sinds medio twintigste eeuw vooral een vorm van gesubsidieerd vervoer, in de beginperiode kwam meer commercieel vervoer voor. Openbaar vervoer is een alternatief voor het zelf kopen of huren van een vervoermiddel.
alternative label: openbaar vervoer

Overijssel
type: Concept
definition: Overijssel is een provincie in het oosten van Nederland. De rivier de IJssel vormt in het zuidwesten grotendeels de natuurlijke grens met Gelderland. Overijssel grenst in het noorden aan Drenthe, in het noordoosten aan Nedersaksen, in het zuidoosten aan Noordrijn-Westfalen, in het zuiden en zuidwesten aan de provincie Gelderland, in het uiterste westen aan Flevoland en in het noordwesten aan Friesland. De stad met de meeste inwoners is Enschede. De hoofdstad van Overijssel is Zwolle. De dialecten die in deze provincie worden gesproken, vallen onder het Nedersaksisch.
alternative label: OV

Overzicht
type: Concept

Parfumerie
type: Concept
definition: Winkel welke parfums verkoopt.
alternative label: parfumshop
alternative label: parfumwinkel

Pensioen
type: Concept
definition: Pensioen is het terugtrekken uit iemands functie of beroep, of uit iemands actieve werkzame leven. Iemand kan ook gedeeltelijk met pensioen gaan door het aantal werkuren of de werkdruk te verminderen.

Pizza
type: Concept
definition: De pizza is een Italiaans gerecht. Het bestaat uit een bodem van deeg, de pizzabodem, waarop voedingsmiddelen als kaas, tomaten, olijven, champignons, groenten en vlees gedaan worden, die doorgaans wordt gebakken in een oven.

Plaats
type: Concept
narrower: Den Haag
narrower: Eindhoven

Plant
type: Concept
definition: De planten (Plantae) vormen een rijk van eukaryoten die hun energie verkrijgen uit fotosynthese en zich meestal niet zelfstandig kunnen voortbewegen. Bijna alle planten bezitten chloroplasten in hun cellen, waarmee ze energie uit zonlicht kunnen vangen om koolhydraten te vormen uit koolstofdioxide en water. De chloroplasten in plantencellen zijn in de loop van de evolutie door endosymbiose ontstaan uit cyanobacteriën. De wetenschap die zich bezighoudt met de bestudering van planten heet botanie.
alternative label: Plantae

Plantenwinkel
type: Concept

Poppodium
type: Concept
definition: Een poppodium is een locatie waar concerten en andere culturele evenementen plaatsvinden. Zij programmeren veelal zelf het aanbod vanuit een stichting. Dit in tegenstelling tot commerciële evenementenlocaties als de Ziggo Dome en Brabanthallen. Ook trachten ze vaak een culturele toevoeging te bieden aan de maatschappij, waardoor poppodia gekenmerkt worden door meer diversiteit aan muziek- en culturele optredens. In veel gevallen wordt dit gesubsidieerd of op een andere manier (mede) gefinancierd door giften, en werken er vrijwilligers. Het zijn meestal kleinere zalen in vergelijking met theaterzalen of concertzalen.

Private Lease
type: Concept
definition: Private lease is een vorm van verhuur gericht op particulieren. Met private lease kan de afnemer tegen een (grotendeels) vaststaand maandelijks tarief gedurende een vooraf afgesproken periode over het geleasete goed beschikken, maar het blijft gedurende en na de leaseperiode eigendom van de leasemaatschappij. Doorgaans is het leasetarief inclusief verzekeringen, belastingen en onderhoud.

Provincie
type: Concept
narrower: Friesland
narrower: Utrecht (prov.)
narrower: Zeeland
alternative label: Provincies
definition: Een provincie is een deelgebied van een land met vaak een eigen regionaal bestuur. Het gaat veelal om een bestuurs- of beheerslaag tussen het nationale en gemeentelijke bestuur, maar hier zijn uitzonderingen op.

Puzzel
type: Concept
definition: Een puzzel is een soort spel of raadsel dat men als tijdverdrijf probeert op te lossen. Iemand die zich bezighoudt met het oplossen van puzzels noemt men een 'puzzelaar'.
alternative label: puzzle game

Radio
type: Concept
definition: Radio is draadloze telecommunicatie met radiogolven. Een radiozender zendt radiogolven uit, die weer ontvangen kunnen worden met een radio-ontvanger. Signalen worden overgebracht met behulp van draaggolven met een hogere frequentie dan die van de over te brengen signalen. Een radio-ontvanger kan door af te stemmen op de frequentie van de draaggolven de betreffende signalen uitfilteren. De grootste frequenties van de over te brengen signalen bepalen de benodigde bandbreedte van het elektromagnetische spectrum.

Recept
type: Concept
definition: Een recept is een verzameling instructies die aangeven hoe iets klaargemaakt moet worden, en wel met name een gerecht.

Recreatie
type: Concept
definition: Onder recreatie verstaat men alle vormen van vrijetijdsbesteding, alle activiteiten die kunnen worden gedaan naast de dagelijkse verplichtingen als werken, huishouden en zorg voor anderen. Recreëren doet men voor ontspanning en vermaak. Het woord op zich, 're-creatie' duidt op vernieuwing, verfrissing; de bedoeling van recreëren is het opladen van de persoonlijke actieradius, het vernieuwen van de energie, het verzetten van de zinnen en het ontladen van opgelopen spanning.
alternative label: ontspanning
alternative label: recreant

Reisbureau
type: Concept
definition: Een reisbureau, reisorganisatie of reisagentschap is een organisatie die bemiddelt tussen aanbieders en afnemers van aan reizen gerelateerde diensten zoals vlieg- en treintickets, hotelovernachtingen en activiteiten zoals excursies. Deze diensten kunnen in veel gevallen los van elkaar geboekt worden maar ook als compleet pakket.
alternative label: reisagentschap
alternative label: reisorganisatie

Reisplanner
type: Concept
definition: Een reisplanner is een computerprogramma om een reis te plannen met het openbaar vervoer. Een soortgelijk programma voor het privévervoer heet een routeplanner. Bijna alle reisplanners zijn alleen op internet te raadplegen. In Nederland is er onder andere de website 9292.nl, de reisplanner op ns.nl en die op rijdendetreinen.nl. Bij de eerste twee kan ook een reis met het openbaar vervoer van deur tot deur gepland worden. Met de planner op rijdendetreinen.nl kunnen alleen treinreizen worden gepland. Met bijvoorbeeld Intercity 3531 (NS) wordt een treindienst bedoeld van treinserie 3500. Dit nummer van de treindienst moet niet verward worden met de eveneens viercijferige nummers van de treinstellen, die ook worden aangegeven. Bij ns.nl wordt in dit geval de treindienst aangeduid als Rit 3531.
alternative label: ov-planner
alternative label: treinplanner

Restaurant
type: Concept
definition: Een restaurant is een uitgaansgelegenheid waar mensen kunnen eten. Een verzamelnaam voor restaurants, samen met hotels en cafés, is horeca.
alternative label: eetcafé

Review
type: Concept
definition: Een recensie, ook wel aangeduid met de Engelse term review, is een (kritische) bespreking van een boek, film, televisieprogramma, computerspel, toneelvoorstelling, muziekuitvoering, enige andere culturele uiting, of een ander product of andere dienst.

Satire
type: Concept
definition: Een satire is een kunstvorm waarbij vaak op humoristische wijze maatschappijkritiek of kritiek op personen wordt gegeven. De kritiek kan geleverd worden via parodie, ironie, sarcasme, pastiche en karikatuur. De doelwitten kunnen personen, politici, tradities, religie, kunstenaars, entertainers, media, normen, waarden, trends zijn. Niet alle satire is uitsluitend humoristisch bedoeld. Sommige satires zijn zo agressief en scherp dat ze vooral willen provoceren of tot actie aanzetten. Hierom zijn door de geschiedenis heen veel satirici vervolgd door de overheid.
alternative label: hekeldicht
alternative label: satires
alternative label: satirisch

Schaatsen
type: Concept

Schiermonnikoog
type: Concept
definition: Schiermonnikoog ) is vanuit het westen gerekend het vijfde bewoonde Nederlandse waddeneiland en behoort tot Friesland. Het eiland is tevens een gemeente, die dezelfde naam draagt. Het aantal inwoners bedroeg per 30 september 2025 988. Schiermonnikoog is hiermee de kleinste gemeente van Nederland qua inwoneraantal, en is tevens de gemeente met de laagste bevolkingsdichtheid in Nederland. Het hoogste aantal inwoners dat officieel op Schiermonnikoog is geregistreerd was in het jaar 1878, toen telde het eiland 1117 inwoners.

Schoenen
type: Concept
definition: Een schoen is de meest gebruikelijke vorm van schoeisel.

School
type: Concept
definition: Alles over scholen.
alternative label: cursus
alternative label: onderwijs
alternative label: opleiding
alternative label: studie

Seks
type: Concept
definition: Geslachtsgemeenschap is een seksuele handeling tussen twee mensen waarbij een penis in erectie een vagina of anus penetreert. Het doel van geslachtsgemeenschap kan seksueel genot zijn, geslachtelijke voortplanting of beide.
alternative label: seks
alternative label: sex

Sieraad
type: Concept
definition: Een sieraad of juweel is elk object dat op het lichaam wordt gedragen met de bedoeling dat te verfraaien.
alternative label: bijou
alternative label: juwelen
alternative label: sieraden
related: Armband
related: Juwelier

Slijterij
type: Concept
definition: Een slijter is een ander woord voor een verkoper van kleinhandel. Een persoon die grote hoeveelheden handelswaar koopt en deze dan weer in kleine hoeveelheden verder verkoopt, wordt een slijter genoemd.
alternative label: drankslijter
alternative label: slijter

Sociale media
type: Concept
definition: Sociale media is een verzamelbegrip voor online platforms waar de gebruikers, zonder of met minimale tussenkomst van een professionele redactie, de inhoud verzorgen. Hoofdkenmerken zijn interactie en dialoog tussen de gebruikers.
narrower: Buurt
narrower: Open Source
alternative label: social media

Speelgoed
type: Concept
definition: Speelgoed zijn voorwerpen die voornamelijk gebruikt worden door kinderen om mee te spelen.

Spel
type: Concept
definition: Een spel is een activiteit, buiten de gewone dagelijkse bezigheden, waaraan een of meer mensen - of bij uitbreiding andere diersoorten - deelnemen, als vermaak, maar ook om vaardigheden en talenten ten volle te benutten of te vergroten.
alternative label: game
alternative label: games
alternative label: gaming
narrower: Arcade game
narrower: Bordspel
narrower: Escaperoom
narrower: Puzzel

Spiritualiteit
type: Concept
definition: Spiritualiteit heeft in de breedste zin te maken met zaken die de geest betreffen. Het woord wordt op vele manieren gebruikt en kan te maken hebben met religie of bovennatuurlijke krachten, maar de nadruk ligt op de persoonlijke innerlijke ervaring.

Sport
type: Concept
definition: Sport is een fysieke krachtmeting, fysiek spel of denkspel dat op reglementaire wijze in competitieverband of recreatief gespeeld kan worden.
narrower: Fitness
narrower: Hardlopen
narrower: Schaatsen
narrower: Sportnieuws
narrower: Sportschool
narrower: Tennis
narrower: Voetbal
narrower: Yoga

Sportnieuws
type: Concept
definition: Websites die veel aandacht besteden aan sportnieuws en recente gebeurtenissen.

Sportschool
type: Concept
definition: Sportschool is de benaming die in Nederland wordt gebruikt om een (privé-)centrum aan te duiden waar sporten beoefend kunnen worden. Dit kan zowel binnen als buiten zijn. Vaak wordt er gedacht aan binnen en dan met name aan krachtsport en bodybuilding, maar dit is maar een klein deel van het aanbod aan sportscholen. Vaak wordt een sportschool met een fitnesscenter verward. In een fitnesscenter wordt geen sport beoefend, maar fitness, zoals krachttraining, cardio en allerlei groepslessen die onder de fitness vallen.
alternative label: gym

Spraakassistent
type: Concept
definition: Een virtuele assistent is een softwareprogramma dat door middel van spraakherkenning taken of diensten kan uitvoeren voor de gebruiker. Het doel hiervan is om een intuïtieve koppeling te bieden tussen een gebruiker en een systeem of apparaat, zodat opdrachten of zoekopdrachten "menselijker" kunnen zijn.
alternative label: spraakassistent

Streamingdienst
type: Concept
definition: Streaming media is multimedia die via een netwerk wordt geleverd voor weergave met een mediaspeler. Media wordt in een stroom van datapakketten van een server naar een client verzonden en wordt in realtime of bijna realtime weergegeven; dit in tegenstelling tot het downloaden van bestanden, een proces waarbij de eindgebruiker een volledig mediabestand verkrijgt voordat hij de inhoud kan bekijken. Streaming wordt vaker gebruikt voor video on demand, streaming televisie en muziekstreamingdiensten via internet.

Streamingplatform
type: Concept

Studieboek
type: Concept
definition: Een studieboek of leerboek is een leermiddel dat gebruikt wordt bij de studie of het leren voor onderwijs in het hoger of universitair onderwijs.

Supermarkt
type: Concept
definition: Een supermarkt is een verkooporganisatie met grootschalige inkoop en afzet aan een consumentenmarkt in de vorm van een zelfbedieningswinkel waar voedingsmiddelen, waaronder verse groente, brood, vlees, kruidenierswaren en huishoudelijke artikelen worden verkocht. Soms behoren meer soorten artikelen, bijvoorbeeld medicijnen, ook tot het assortiment, en heeft de winkel deels het karakter van een warenhuis. Supermarkten zijn vaak onderdeel van een keten die in een regio, land of zelfs meerdere landen winkels heeft. Een kleine varende supermarkt noemt men een parlevinker.

Sushi
type: Concept
definition: Sushi is een gerecht uit de Japanse keuken met een doorsnede van enkele centimeters. Het bestaat altijd uit afgekoelde gekookte rijst en vaak ook uit zeewier en is met rijstazijn gezuurd. Dit wordt meestal gecombineerd met andere ingrediënten zoals vis of zeevruchten, gebakken ei, groenten en soms tropische vruchten. De ingrediënten en presentatie van sushi kunnen sterk uiteenlopen, maar het ingrediënt dat alle sushi gemeenschappelijk hebben is rijst.

Taal
type: Concept
definition: Taal is een systeem van symbolische tekens – zoals gesproken klanken, gebaren of geschreven symbolen – waarvan de mens gebruikmaakt om zijn gedachten te articuleren, zijn wereld te ordenen en te communiceren. Talen kenmerken zich door grammaticale regels en een woordenschat.

Taart
type: Concept
definition: Een taart is een meestal cirkelvormig en vaak zoet baksel dat in veel landen voornamelijk wordt gegeten tijdens feestelijkheden, bijvoorbeeld bij het vieren van een verjaardag. In veel landen wordt taart ook als nagerecht geserveerd.

Taxi
type: Concept
definition: Een taxi is een vervoermiddel dat op afroep een of meer reizigers vervoert op een door de reiziger zelf gewenst tijdstip en traject, op basis van een vast bedrag per afstandseenheid of een vooraf overeengekomen ritprijs.
alternative label: taxicentrale
alternative label: taxivervoer
alternative label: taxivervoerder

Taxidermie
type: Concept
definition: De taxidermie houdt zich bezig met het prepareren of opzetten van dieren. Prepareren is het bewerken van het dode lichaam van een dier, zodat het geconserveerd blijft. Iemand die dit doet, noemt men een taxidermist of preparateur. Er zijn verschillende technieken om dieren te conserveren. Een dier dat is opgezet voor wetenschappelijke doeleinden noemt men een zoölogisch specimen.

Telefonie abonnement
type: Concept
definition: Telefonie of telefoon is een telecommunicatiesysteem voor gesprekken tussen personen die zich buiten gehoorbereik van elkaar bevinden. Hiervoor hebben alle gesprekspartners een telefoontoestel nodig en moet tussen die toestellen een verbinding zijn. Die verbinding kan een directe draadverbinding zijn, bijvoorbeeld voor een eenvoudige huistelefoon, maar inmiddels zijn de meeste telefoontoestellen aangesloten op het wereldwijde netwerk van telefooncentrales en zijn veel verbindingen draadloos.

Tennis
type: Concept
definition: Tennis is een balsport voor twee spelers (enkelspel) of paren (dubbelspel), waarbij een bal van gemiddeld 67 mm diameter met een racket over een net gespeeld moet worden.

Terschelling
type: Concept
definition: Terschelling is een eiland en een gemeente in de provincie Friesland, tot 1942 in de provincie Noord-Holland. Vanaf het westen gerekend is Terschelling het derde bewoonde Nederlandse Waddeneiland.

Theater
type: Concept
definition: Een theater of schouwburg is een gebouw dat door middel van allerlei technische en logistieke voorzieningen is toegerust voor het vertonen en bijwonen van theater, optreden, performances en andere soorten voorstellingen. De grote schouwburgen zijn vaak een lijsttheater, dat wil zeggen dat de mensen op de voorste rij iets lager dan het podium zitten. Theaters kunnen ook een vlakke vloer hebben.
alternative label: schouwburg

Themamuseum
type: Concept

Thuisbatterij
type: Concept
definition: Een thuisbatterij, ook wel thuisaccu genoemd, is een grote oplaadbare batterij voor huishoudelijk gebruik, bedoeld om elektrische energie die ofwel lokaal opgewekt wordt of op bepaalde momenten goedkoper is, op te slaan voor later gebruik. De laadcapaciteit in woningen varieert typisch tussen 1 en 10 kWh.
alternative label: thuisaccu

Thuiszorg
type: Concept
definition: Thuiszorg is verzorging en verpleging die bij cliënten thuis wordt geleverd. De thuiszorg behoort tot de extramurale gezondheidszorg of eerstelijnsgezondheidszorg. Ze levert verschillende soorten dienstverlening. De belangrijkste zijn verpleging, kraamzorg, huishoudelijke verzorging en persoonlijke verzorging, gespecialiseerde verzorging/verpleging.

Tickets
type: Concept

Tijdschrift
type: Concept
definition: Een tijdschrift, periodiek, maandblad of weekblad is een periodieke publicatie die per aflevering bestaat uit een bundeling van artikelen. Een tijdschrift kan betaalde advertenties bevatten. In andere gevallen wordt het tijdschrift volledig gefinancierd door de verkoopprijs of functioneert het als een communicatiemiddel aan leden en donateurs van een organisatie. De meeste tijdschriften steunen op een gemengde financiering op basis van advertenties en verkoop.
alternative label: maandblad
alternative label: magazine
alternative label: weekblad
narrower: ICT tijdschrift

Tiny house
type: Concept
definition: De tiny house-beweging is een architectonische en sociale beweging die de verkleining en vereenvoudiging van woonruimtes promoot. Tiny houses worden gepromoot als een goedkoper en soms milieuvriendelijker alternatief voor de woningmarkt, en ze worden ook gezien als een huisvestingsoptie voor daklozen. Het gebrek aan duidelijk gedefinieerde kenmerken en de vaak onduidelijke wettelijke aspecten kunnen echter problemen opleveren voor eigenaren, zoals een hogere prijs per vierkante meter, kwetsbaarheid voor natuurrampen, gebrek aan opslagruimte, moeilijkheden bij het ontvangen van gasten, kleinere of ontbrekende huishoudelijke apparaten, en juridische en/of bestemmingsplanproblemen.
alternative label: tiny houses

Transcriptietool
type: Concept
definition: Transcriptie is in de taalkunde het zo klankgetrouw mogelijk weergeven van een geschreven tekst of een gesproken taaluiting. Een in de wetenschap veelgebruikt transcriptiesysteem voor de spreektaal is het Internationaal Fonetisch Alfabet (IPA) en het ASCII-equivalent SAMPA. Het overzetten zelf wordt "transcriberen" genoemd, de uitvoerder daarvan is een "transcribeur".
alternative label: vergaderassistent

Trein
type: Concept
definition: Een trein is in de dagelijkse betekenis een voertuig bestaande uit een aantal aan elkaar gekoppelde kortere delen op rails, waarbij een of meer van deze delen zorgen voor de aandrijving (tractie). De kortere delen kunnen zijn een locomotief, een spoorwegrijtuig, een goederenwagon of een treinstel, dat op zijn beurt bestaat uit bakken.

Trend
type: Concept
definition: Een trend is een ontwikkeling op langere termijn, binnnen de maatschappij. Trends worden vaak aangegeven door mode- of andere ontwerpers, maar kunnen ook voortkomen uit een rage waar ontwerpers dan verder op inhaken. Soms is een film of een serie aanleiding. Een trend duurt langer dan een seizoen en is altijd van invloed op het komende seizoensbeeld. Vaak duurt het meerdere seizoenen voor een trend volledig doorgebroken is. Wanneer de trend iedereen bereikt heeft, is er vaak weer behoefte aan iets nieuw. "Trendsetters" zijn diegenen die het eerste zijn of de aanzet geven. Op allerlei vlakken zijn er trends, binnen de mode gaat het om kleding, schoenen en accessoires, daarbuiten om kapsels, lifestyle, interieur, kleuren, eten en drinken, elektronica, reizen enzovoort. Het komt ook voor dat trends uit het verleden weer opduiken, soms lichtjes aangepast qua materialen en vormgeving. Zo is er soms een revival van een bepaalde periode of decennium.

Trouwen
type: Concept
definition: Het huwelijk of matrimonium is een samenlevingsvorm die wereldwijd sinds duizenden jaren van belang is als economische, juridische, religieuze en/of sociale vorm van het onderhouden en structureren van duurzame vriendschappelijke en seksuele relaties, familieverbanden, arbeidskracht en bezit, geregeld door burgerlijk recht, religieus recht en/of gewoonte en traditie.
alternative label: bruiloft
alternative label: huwen

Tuin
type: Concept
definition: Een tuin is een begrensd, meestal omheind stuk grond waarop gewassen of andere vormen van beplanting worden geplant of verbouwd. Een tuin kan utilitair van aard zijn, zoals een groentetuin, wetenschappelijk, zoals een botanische tuin, of decoratief, zoals een siertuin. Deze vormen kunnen ook worden gecombineerd. In de siertuin kan ook bestrating een belangrijke rol spelen. De belangrijkste eigenschap die een tuin onderscheidt van een andere vorm van natuur, is dat de opzet van de tuin door mensen bedacht is en onderhouden wordt.
narrower: Tuinmeubel

Tuincentrum
type: Concept
definition: Een tuincentrum is een winkel gespecialiseerd in de verkoop van tuinartikelen.

Tuinmeubel
type: Concept
definition: Tuinmeubels zijn meubels die vooral in de tuin gebruikt worden. Ze kunnen uitgevoerd zijn in verschillende soorten (weersbetendige) materialen, zoals kunststof, hout of metaal. Er zijn eenvoudige, goedkope en zeer dure luxueuze versies, afhankelijk van omvang, materiaalkeuze en afwerking.

TV
type: Concept

TV-serie
type: Concept

Tweedehands
type: Concept
definition: Tweedehands is de aanduiding voor goederen die al bij iemand anders in eigendom voor het gebruik zijn geweest. Hier wordt het begrip "hand" gebruikt voor eigendom.

Uitvaartverzekering
type: Concept

Uitzendbureau
type: Concept

Universiteit
type: Concept
definition: Een universiteit is een onderwijsinstelling in het hoger onderwijs die ingericht is om wetenschappelijk onderwijs te bieden en wetenschappelijk onderzoek te verrichten. Zij verzorgt academische opleidingen en verleent academische graden.

Utrecht (prov.)
type: Concept
definition: Alles over de provincie Utrecht.

Vacature
type: Concept
definition: Een vacature is een onvervulde arbeidsplaats op de arbeidsmarkt, binnen een bedrijf, een organisatie of een overheidsdienst die openstaat voor werkzoekenden.
narrower: Uitzendbureau

Vakantie
type: Concept
definition: Vakantie is een meerdaagse periode waarin iemand zijn gewoonlijke dagelijkse activiteiten staakt en tijdelijk niet naar school, studie, of werk gaat. Het woord vakantie is afgeleid van het Latijnse vacare, dat staat voor leeg of vrij zijn. Vakantie staat dan voor het vrij zijn van verplichtingen. Omstreeks 1850 kreeg het begrip de huidige betekenis. In de loop van de tijd zijn er voor veel werknemers, scholieren, studenten en sommige groepen zelfstandigen regels gekomen over de periode en omvang van de vakantie. Sinds ongeveer 1960 maakt het fenomeen vakantie een stormachtige groei door. Gaandeweg is vakantie gekoppeld aan het maken van een reis of bezoeken van een bepaalde bestemming: men gaat op vakantie.
narrower: Bed and Breakfast
narrower: Hotel
narrower: Reisbureau
narrower: Review
narrower: Vakantiehuis

Vakantiehuis
type: Concept

Vakantiepark
type: Concept
definition: Een vakantiepark is een park met vakantiehuizen die verhuurd worden aan vakantiegangers en toeristen.
alternative label: vakantiepark

Veiligheid
type: Concept
definition: Veiligheid is de mate van afwezigheid van potentiële oorzaken van een gevaarlijke situatie of de mate van aanwezigheid van beschermende maatregelen tegen deze potentiële oorzaken. Veiligheid is een relatief begrip, aangezien niets onder alle omstandigheden volledig zonder gevaar is.
alternative label: onkrenkbaarheid

Veiling
type: Concept
definition: Een veiling is doorgaans een proces van het kopen en verkopen van goederen of diensten door ze aan te bieden, biedingen te ontvangen en het item vervolgens te verkopen aan de hoogste bieder of te kopen van de laagste bieder. Er bestaan ​​enkele uitzonderingen op deze definitie, die worden beschreven in het hoofdstuk over verschillende veilingtypen. De tak van de economische theorie die zich bezighoudt met veilingtypen en het gedrag van deelnemers aan veilingen, wordt veilingtheorie genoemd.

Vergelijken
type: Concept
definition: Vergelijken is het proces waarbij twee of meer dingen worden geëvalueerd door de relevante, vergelijkbare kenmerken van elk ding te bepalen, en vervolgens vast te stellen welke kenmerken op elkaar lijken, welke verschillen en in welke mate. Wanneer kenmerken verschillen, kunnen deze verschillen vervolgens worden geëvalueerd om te bepalen welk ding het meest geschikt is voor een bepaald doel. De beschrijving van de overeenkomsten en verschillen tussen de twee dingen wordt ook wel een vergelijking genoemd. Vergelijken kan vele verschillende vormen aannemen, afhankelijk van het vakgebied: vergelijken is twee of meer dingen samenbrengen en ze systematisch onderzoeken, waarbij overeenkomsten en verschillen worden vastgesteld. De betekenis van vergelijken verschilt per vakgebied. Elke verkenning van de overeenkomsten of verschillen tussen twee of meer eenheden is een vergelijking. In de meest beperkte zin bestaat het uit het vergelijken van twee van elkaar geïsoleerde eenheden.
alternative label: vergelijking

Verkeer
type: Concept
definition: Verkeer is de verplaatsing van mensen, planten, dieren en objecten, bijvoorbeeld wegverkeer, spoorwegverkeer, andere verplaatsing over land, en verplaatsing van schepen en vliegtuigen; ook communicatie met dataverkeer en bijvoorbeeld radiogolven worden ertoe gerekend.

Verlichting
type: Concept
definition: Een apparaat, vast of draagbaar, waarvan het primaire doel is om kunstlicht te produceren.

Verzekering
type: Concept
definition: Een verzekering of assurantie is een overeenkomst tussen een verzekeringsmaatschappij en een verzekeringnemer. Met een verzekering poogt de verzekeringnemer de financiële gevolgen van een risico af te dekken die hij zelf niet kan of wil dragen.
alternative label: assurantie
narrower: Autoverzekering
narrower: Huisdierverzekering
narrower: Uitvaartverzekering
narrower: Zorgverzekering

Vlieland
type: Concept
definition: Vlieland is vanuit het westen gerekend het tweede bewoonde Nederlandse Waddeneiland. Het ligt in de provincie Friesland maar behoorde tot 1942 tot de provincie Noord-Holland. De gelijknamige gemeente omvat naast het eiland ook een deel van de Waddenzee. Ten zuidwesten van Vlieland ligt het eiland Texel en ten noordoosten ligt het eiland Terschelling. Van de vijf Nederlandse Waddeneilanden heeft Vlieland de hoogste duintop: 45 meter hoog.

Voetbal
type: Concept
definition: Voetbal is een wereldwijd populaire balsport waarbij twee ploegen van elf spelers moeten proberen de bal in het doel van de tegenstander te krijgen. De bal mag met ieder deel van het lichaam gespeeld worden, met uitzondering van armen en handen. In de praktijk wordt vooral met de voet gespeeld en met het hoofd gekopt. Ook moet de bal te allen tijde speelbaar blijven en mag deze niet afgeklemd worden door bijvoorbeeld op de bal te gaan liggen of deze tussen de benen te klemmen. Deze beperkingen gelden niet voor de doelverdediger, ook wel keeper genoemd, in het eigen strafschopgebied.
narrower: EK voetbal
narrower: Eredivisie voetbal
narrower: Voetbalclub
narrower: Voetbalcompetitie

Voetbalclub
type: Concept
definition: In het voetbal is een voetbalclub een sportvereniging die fungeert als een entiteit waaronder voetbalteams hun sportactiviteiten organiseren. De club kan bestaan ​​als een onafhankelijke eenheid of als onderdeel van een grotere sportorganisatie, als dochteronderneming van de moederclub of -organisatie.

Voetbalcompetitie
type: Concept
definition: Een voetbaltoernooi is een toernooi waarbij de sport voetbal beoefend wordt. Er zijn verschillende competitievormen, zoals de poulevorm. De meeste bekercompetities hanteren een knock-outsysteem.

Vrije tijd
type: Concept
definition: Vrije tijd is de tijd die men niet hoeft te besteden aan verplichte of noodzakelijke activiteiten zoals (huishoudelijk) werk, zorg en studie.
narrower: Casino
narrower: Dierenpark
narrower: Liefde
narrower: Museum
narrower: Sociale media
narrower: Spel
narrower: Spiritualiteit
narrower: Theater

Waddeneiland
type: Concept
definition: Een wad in zeegebied is een slik- of zandplaat die in een ondiepe zee is ontstaan, met een hoogte die zich tussen het normale laagwater- en hoogwaterniveau van een vlak getijdengebied bevindt.
narrower: Schiermonnikoog
narrower: Terschelling
narrower: Vlieland

Wandelroute
type: Concept

Warenhuis
type: Concept
definition: Een warenhuis is een grote winkel, vaak met meerdere verdiepingen, die een uitgebreid assortiment aan goederen verkoopt.

Weer
type: Concept
definition: Het weer is de gesteldheid van de atmosfeer op een bepaald moment en op een specifieke plaats. Het weerbeeld wordt bepaald door een samenspel van weerelementen zoals temperatuur, luchtdruk, neerslag, luchtvochtigheid, bewolkingsgraad en windsnelheid. Deze factoren vormen samen de directe omstandigheden die mensen buitenshuis dagelijks ervaren. De wetenschap die zich bezighoudt met de bestudering van het weer, heet meteorologie. Meteorologen onderzoeken de fysische processen in de atmosfeer en gebruiken waarnemingen, satellietgegevens en computermodellen om veranderingen te begrijpen en weersvoorspellingen te maken.

Wellness
type: Concept

Wenskaart
type: Concept
definition: Een wenskaart is een kartonnen poststuk ter schriftelijke kennisgeving van een wens aan iemands adres. De kaart kan worden opgestuurd of persoonlijk worden overhandigd.
alternative label: Verjaardagskaart

Werk
type: Concept
definition: Arbeid is het verrichten van bezigheden die nut hebben voor diegene die de arbeid verricht, voor zijn of haar naaste omgeving of voor de maatschappij als geheel. Deze ruime definitie is van de socioloog Mok, maar er zijn ook beperktere waarin betaling voor de activiteit als voorwaarde wordt gesteld. Onbetaalde arbeid wordt daarbij dus niet als arbeid gezien. In ruimere zin kan echter onderscheid worden gemaakt tussen betaalde en onbetaalde arbeid en formele en informele arbeid. Informele arbeid wordt niet geregistreerd door overheidsinstanties en er wordt geen belasting afgedragen.
alternative label: arbeid
alternative label: baan
narrower: Pensioen
narrower: Vacature

Wetenschap
type: Concept
definition: Wetenschap is zowel de systematisch verkregen, geordende en verifieerbare menselijke kennis, als de wetenschappelijke gemeenschap waarin deze kennis wordt verzameld. Deze gemeenschap heeft haar eigen methodes en conventies om, per vakgebied, tot een samenhangend geheel van hypotheses, wetmatigheden en theorieën te komen.

Wijn
type: Concept

Winkel
type: Concept
definition: Een winkel is een plaats waar koopwaar wordt aangeboden en verkocht. Naast fysieke winkels zijn er ook webwinkels en tussenvormen en combinaties van beide.
narrower: Boek
narrower: Bordspel
narrower: Bouwmarkt
narrower: Cadeaukaart
narrower: Dierenwinkel
narrower: Discount
narrower: Drogist
narrower: Elektronica
narrower: Fiets
narrower: Juwelier
narrower: Kleding
narrower: Meubel
narrower: Plantenwinkel
narrower: Schoenen
narrower: Speelgoed
narrower: Supermarkt
narrower: Tickets
narrower: Tuincentrum
narrower: Tweedehands
narrower: Veiling
narrower: Warenhuis
narrower: Winkelcentrum
narrower: Woondecoratie

Winkelcentrum
type: Concept
definition: Een winkelcentrum of winkelcomplex is een gebouw of een reeks gebouwen waarin meerdere winkels zijn gevestigd, verbonden door gangen die het de klanten gemakkelijk maken om van winkel naar winkel te lopen. Winkelcentra zijn meestal voorzien van grote parkeerplaatsen.

Wonen
type: Concept
definition: Wonen of gehuisvest zijn is permanent op één vaste plek leven. Deze plek is meestal een woning of andere woonruimte, maar kan in ruimere zin slaan op elke plek waar men langere tijd verblijft zoals een gevangenis of grot.

Woningmarkt
type: Concept
definition: Alles over de woningmarkt.

Woondecoratie
type: Concept
definition: Woondecoratie zijn onderdelen van een interieur die verplaatsbaar en makkelijk te vervangen zijn. Onder deze noemer vallen zaken zoals sierkussens, tafelkleden, bijzettafels, vloerkleden, spiegels, vazen en andere decoratieve objecten.

Yoga
type: Concept
definition: Yoga is een van de zes orthodoxe of astika filosofische scholen (darsana's) van het hindoeïsme. Yoga leert de geest, het gevoel en het lichaam te beheersen, om daarmee de vereniging met God te bereiken.

Young Adult
type: Concept
definition: Jeugdliteratuur, ook wel kinder- en jeugdliteratuur, is literatuur die kinderen en jongeren aanspreekt en meestal speciaal voor hen is geschreven. De onderwerpen focussen op hun wereld en klinken in hun taal. Tussen de jeugdliteratuur en de volwassenenliteratuur zit een overgang: de adolescentenliteratuur, voor jongeren vanaf ongeveer 18. Deze adolescentenliteratuur wordt tegenwoordig ook wel aangeduid als young adult.

Zeeland
type: Concept
definition: Zeeland is een provincie in het zuidwesten van Nederland. Zeeland grenst aan de Nederlandse provincies Zuid-Holland en Noord-Brabant en de Belgische provincies West-Vlaanderen, Oost-Vlaanderen en Antwerpen. Zeeland telt 394.514 inwoners, bestuurlijk centrum van de provincie is de hoofdstad Middelburg, tevens de grootste stad in de provincie gevolgd door havenstad Vlissingen en het centraal gelegen Goes. De gemeente met de meeste inwoners is echter Terneuzen in Zeeuws-Vlaanderen. Het bijvoeglijk naamwoord is Zeeuws en de bewoners heten Zeeuwen.

Zeilen
type: Concept
definition: De zeilsport omvat diverse competitievormen die worden georganiseerd door verschillende zeilfederaties en jachtclubs. Wedstrijden omvatten duels binnen een vloot zeilboten, tussen twee boten of tussen teams. Daarnaast zijn er gespecialiseerde wedstrijden waarbij snelheidsrecords worden gevestigd. Wedstrijden vinden plaats op zowel gesloten parcoursen als van punt naar punt; ze kunnen plaatsvinden in beschutte wateren, langs de kust of op open zee. De meeste wedstrijden worden gehouden binnen vastgestelde klassen of ratings, die ofwel één type zeilboot omvatten om ervoor te zorgen dat de wedstrijd voornamelijk op vaardigheid gebaseerd is, ofwel de zeilboten classificeren om classificaties of handicaps te creëren.
alternative label: wedstrijdzeilen
alternative label: zeilsport

Ziekenhuis
type: Concept
definition: Een ziekenhuis is een instelling waar zieke en gewonde mensen verzorgd worden en waar professionele gezondheidszorg wordt verleend. Dit gebeurt door artsen, medisch specialisten en verpleegkundigen.

Zoekmachine
type: Concept
definition: Een zoekmachine is een computerprogramma waarmee informatie kan worden gezocht in een bepaalde collectie; dit kan een bibliotheek, het internet, of een persoonlijke verzameling zijn.
alternative label: zoekrobot

Zorg
type: Concept
definition: De gezondheidszorg in een bepaald land is het geheel aan activiteiten, aangestuurd en grotendeels gefinancierd door de overheid, dat gericht is op de verbetering van de gezondheid van de bevolking. De gezondheidszorg past geneeskundige kennis toe om de gezondheid van mensen te verbeteren, ziekte te voorkomen of te genezen, en om het lichamelijk en psychisch functioneren te verbeteren. Middels zorgevaluatie kan de gezondheidszorg getoetst worden.
narrower: Gehandicaptenzorg
narrower: Gezondheidszorg
narrower: Jeugdzorg
narrower: Kraamzorg
narrower: Mantelzorg
narrower: Ouderenzorg
narrower: Thuiszorg
narrower: Zorgconsultancy
narrower: Zorgverzekering

Zorgconsultancy
type: Concept

Zorgverzekering
type: Concept